{"text_format":"1","workbook":"xlsx","n_sheets":8,"sheets":["Ofgem","Scenario results (Ofgem)","Rating (Ofgem-notional)","Rating (Ofgem-actual)","NGN","Scenario results (NGN)","Rating (NGN-notional)","Rating (NGN-actual)"],"not_rendered":{"charts":0,"images":2,"macros":1,"external_links":8,"defined_names":2187,"comments":4,"pivot_tables":0},"unopened":[],"bounds":{"document_bytes":16777216,"sheet_cells":100000,"rows_first":2000,"rows_last":500,"rows_between":2000,"halvings":0,"cell_chars":16384,"cell_head_chars":4096},"cells_cut":0,"cells_raw":0,"read":"whole","date_system":"1900"}

{"sheet":"Ofgem","index":0,"n_rows":100,"n_cols":7,"rows_kept":100,"cut":false,"hidden":false,"merged":[]}
["Parameter","AICR","Gearing","FFO/Net Debt","RCF/Net Debt","FFO Interest Cover"]
["Baa1 Target",{"$f":"'Rating (Ofgem-notional)'!$C$77","v":1.4},{"$f":"'Rating (Ofgem-notional)'!$H$78","v":0.75},{"$f":"'Rating (Ofgem-notional)'!$D$77","v":0.11},{"$f":"'Rating (Ofgem-notional)'!$E$77","v":7.0000000000000007E-2},2.5]
["Baseline",1.3,0.7,0.09,0.05]
["Real to nominal prices conversion factor",{"$f":"[7]Input!AP92","v":1.0792234436566936},{"$f":"[7]Input!AQ92","v":1.1008045880729058},{"$f":"[7]Input!AR92","v":1.1228172888985442},{"$f":"[7]Input!AS92","v":1.1452701759324246},{"$f":"[7]Input!AT92","v":1.1681720515427552}]
[]
["Table 7.2. Financial Parameters (notional): Ofgem's Base case",null,null,null,null,null,"£m, 18/19 prices"]
["Parameter","2021/22","2022/23","2023/24","2024/25","2025/26","GD-2 Average"]
["Closing RAV",{"$f":"[7]ScenarioRun_AllOutputData!AP101/B4","v":2277.9851356559325},{"$f":"[7]ScenarioRun_AllOutputData!AQ101/C4","v":2326.6762415340932},{"$f":"[7]ScenarioRun_AllOutputData!AR101/D4","v":2371.6069037836273},{"$f":"[7]ScenarioRun_AllOutputData!AS101/E4","v":2407.6785586694455},{"$f":"[7]ScenarioRun_AllOutputData!AT101/F4","v":2433.6542773712013},{"$f":"AVERAGE(B8:F8)","v":2363.5202234028598}]
["Fast Money, %",{"$f":"[7]TIM!AP144/([7]TIM!AP144+[7]TIM!AP146)","v":0.35242445118646271},{"$f":"[7]TIM!AQ144/([7]TIM!AQ144+[7]TIM!AQ146)","v":0.33909841164462556},{"$f":"[7]TIM!AR144/([7]TIM!AR144+[7]TIM!AR146)","v":0.33704944118026919},{"$f":"[7]TIM!AS144/([7]TIM!AS144+[7]TIM!AS146)","v":0.33932719124171867},{"$f":"[7]TIM!AT144/([7]TIM!AT144+[7]TIM!AT146)","v":0.35047587834001787},{"$f":"AVERAGE(B9:F9)","v":0.3436750747186188}]
["Slow Money, %",{"$f":"[7]TIM!AP146/([7]TIM!AP144+[7]TIM!AP146)","v":0.64757554881353729},{"$f":"[7]TIM!AQ146/([7]TIM!AQ144+[7]TIM!AQ146)","v":0.66090158835537438},{"$f":"[7]TIM!AR146/([7]TIM!AR144+[7]TIM!AR146)","v":0.66295055881973075},{"$f":"[7]TIM!AS146/([7]TIM!AS144+[7]TIM!AS146)","v":0.66067280875828138},{"$f":"[7]TIM!AT146/([7]TIM!AT144+[7]TIM!AT146)","v":0.64952412165998208},0.6563249252813812]
["Fast pot expenditure",{"$f":"[7]ScenarioRun_AllOutputData!AP102/B4","v":87.826896444845843},{"$f":"[7]ScenarioRun_AllOutputData!AQ102/C4","v":86.563012823589986},{"$f":"[7]ScenarioRun_AllOutputData!AR102/D4","v":85.816418981275746},{"$f":"[7]ScenarioRun_AllOutputData!AS102/E4","v":84.198432057053992},{"$f":"[7]ScenarioRun_AllOutputData!AT102/F4","v":84.909718941974617},85.862895849748028]
["Non-controllable opex",{"$f":"[7]ScenarioRun_AllOutputData!AP103/B4","v":95.206074704172721},{"$f":"[7]ScenarioRun_AllOutputData!AQ103/C4","v":95.071821422426382},{"$f":"[7]ScenarioRun_AllOutputData!AR103/D4","v":92.899248800816224},{"$f":"[7]ScenarioRun_AllOutputData!AS103/E4","v":91.384081847178919},{"$f":"[7]ScenarioRun_AllOutputData!AT103/F4","v":89.385407559439571},92.789326866806761]
["RAV depreciation",{"$f":"[7]ScenarioRun_AllOutputData!AP104/B4","v":115.91769497142201},{"$f":"[7]ScenarioRun_AllOutputData!AQ104/C4","v":119.81378458917922},{"$f":"[7]ScenarioRun_AllOutputData!AR104/D4","v":123.86369243125715},{"$f":"[7]ScenarioRun_AllOutputData!AS104/E4","v":127.76337901646362},{"$f":"[7]ScenarioRun_AllOutputData!AT104/F4","v":131.28435662610121},123.72858152688464]
["Return",{"$f":"[7]ScenarioRun_AllOutputData!AP105/B4","v":65.077778315497696},{"$f":"[7]ScenarioRun_AllOutputData!AQ105/C4","v":65.633787737161839},{"$f":"[7]ScenarioRun_AllOutputData!AR105/D4","v":66.398966759248836},{"$f":"[7]ScenarioRun_AllOutputData!AS105/E4","v":67.22233598702735},{"$f":"[7]ScenarioRun_AllOutputData!AT105/F4","v":67.903835447745308},66.4473408493362]
["Equity issuance cost",{"$f":"[7]ScenarioRun_AllOutputData!AP106/B4","v":5.472484649838032},{"$f":"[7]ScenarioRun_AllOutputData!AQ106/C4","v":0},{"$f":"[7]ScenarioRun_AllOutputData!AR106/D4","v":0},{"$f":"[7]ScenarioRun_AllOutputData!AS106/E4","v":0},{"$f":"[7]ScenarioRun_AllOutputData!AT106/F4","v":0},1.0944969299676064]
{"$rows_left_out":86}
{"sheet":"Scenario results (Ofgem)","index":1,"n_rows":21,"n_cols":13,"rows_kept":21,"cut":false,"hidden":false,"merged":[[3,1,3,5],[3,7,3,11],[5,1,5,5],[5,7,5,11]]}
["Scenario","AICR","Gearing","FFO/Net Debt","RCF/Net Debt","Moodys' implied rating",null,"AICR","Gearing","FFO/Net Debt","RCF/Net Debt","Moodys' implied rating"]
["Baa1 Target",{"$f":"'Rating (Ofgem-notional)'!$C$77","v":1.4},{"$f":"'Rating (Ofgem-notional)'!$H$78","v":0.75},{"$f":"'Rating (Ofgem-notional)'!$D$77","v":0.11},{"$f":"'Rating (Ofgem-notional)'!$E$77","v":7.0000000000000007E-2},{"$f":"'Rating (Ofgem-notional)'!$H$13","v":8.49},null,{"$f":"'Rating (Ofgem-notional)'!$C$77","v":1.4},{"$f":"'Rating (Ofgem-notional)'!$H$78","v":0.75},{"$f":"'Rating (Ofgem-notional)'!$D$77","v":0.11},{"$f":"'Rating (Ofgem-notional)'!$E$77","v":7.0000000000000007E-2},{"$f":"'Rating (Ofgem-notional)'!$H$13","v":8.49}]
["Baseline",1.3,0.7,0.09,0.05,{"$f":"'Rating (Ofgem-notional)'!$H$14","v":9.49},null,1.3,0.7,0.09,0.05,{"$f":"'Rating (Ofgem-notional)'!$H$14","v":9.49}]
["Active selection"]
["RoRe underperformance (-2%)",{"$f":"INDEX(Ofgem!B$68:B$82,MATCH(ActiveScenario,Ofgem!$A$68:$A$82,0))","v":1.0715417243358902},{"$f":"INDEX(Ofgem!C$68:C$82,MATCH(ActiveScenario,Ofgem!$A$68:$A$82,0))","v":0.62655500913305162},{"$f":"INDEX(Ofgem!D$68:D$82,MATCH(ActiveScenario,Ofgem!$A$68:$A$82,0))","v":8.1109694536379312E-2},{"$f":"INDEX(Ofgem!E$68:E$82,MATCH(ActiveScenario,Ofgem!$A$68:$A$82,0))","v":6.1951166208390529E-2},{"$f":"'Rating (Ofgem-notional)'!$N$63","v":"Baa3"},{"$f":"'Rating (Ofgem-notional)'!$N$48","v":9.6025104602510449},{"$f":"INDEX(Ofgem!B$86:B$100,MATCH(ActiveScenario,Ofgem!$A$68:$A$82,0))","v":1.0734465706692049},{"$f":"INDEX(Ofgem!C$86:C$100,MATCH(ActiveScenario,Ofgem!$A$68:$A$82,0))","v":0.69604850281796771},{"$f":"INDEX(Ofgem!D$86:D$100,MATCH(ActiveScenario,Ofgem!$A$68:$A$82,0))","v":7.7430505190110854E-2},{"$f":"INDEX(Ofgem!E$86:E$100,MATCH(ActiveScenario,Ofgem!$A$68:$A$82,0))","v":4.8681857472676324E-2},{"$f":"'Rating (Ofgem-actual)'!N50","v":"Baa3"},{"$f":"'Rating (Ofgem-actual)'!N48","v":9.6025104602510449}]
[null,"Notional Financial structure",null,null,null,null,null,"Actual Financial Structure"]
["Ofgem Base case",1.4958600604514651,0.60257866787297287,9.8568836358286685E-2,7.8654332388888359E-2,"Baa1",8.0523198420533078,1.3119588346178805,0.68452809631725275,8.6349895466899168E-2,5.7129442641857889E-2,"Baa2",8.7847533632286989]
["High interest rates (+1%)",1.5163042371468964,0.59959436331035232,0.10084669322083792,8.0832920961055724E-2,"Baa1",7.7374749498997994,1.256838327443337,0.68518505466620017,8.5580666825411489E-2,5.638732381451652E-2,"Baa2",8.7847533632286989]
["Low interest rates (-1%)",1.4748754645122668,0.605538595248586,9.633897531527516E-2,7.6521744369203379E-2,"Baa1",8.0523198420533078,1.3798868774275395,0.68423280218449667,8.6826846127950691E-2,5.7594325480792373E-2,"Baa2",8.7847533632286989]
["High inflation (+1%)",1.5308403367776811,0.58951582558202276,9.9275356725700981E-2,7.8917163915302874E-2,"Baa1",7.7374749498997994,1.3628080527373645,0.65161966061159537,9.1856670240564528E-2,6.2618550874652679E-2,"Baa2",8.7847533632286989]
["Low inflation (-1%)",1.4614403316121238,0.61616412640165241,9.7919719390879928E-2,7.8442266111845668E-2,"Baa1",8.0523198420533078,1.2564144409050026,0.719946080893479,8.0822138105030389E-2,5.1633090131986789E-2,"Baa2",8.7847533632286989]
["High CPIH-RPI divergence (+0.5%)",1.4785803933157338,0.60930434457461402,9.8237116165105484E-2,7.8541964518060808E-2,"Baa1",8.0523198420533078,1.2975746393678413,0.69484437260438858,8.4755488360944403E-2,5.5538375955925236E-2,"Baa2",8.7847533632286989]
["Low CPIH-RPI divergence (-0.5%)",1.5132798649423524,0.59598361763844199,9.8914907417173306E-2,7.8779391583783803E-2,"Baa1",7.7374749498997994,1.3256210650807443,0.67450389509482878,8.7928172353696876E-2,5.8706732597502462E-2,"Baa2",8.7847533632286989]
["RPI ILD",1.6209903759807169,0.60254580794702772,9.8587706821814919E-2,7.8672116737231096E-2,"Baa1",8.0523198420533078,1.3119588346178805,0.68452809631725275,8.6349895466899168E-2,5.7129442641857889E-2,"Baa2",8.7847533632286989]
["High ILD proportion (+5%)",1.5403221315790976,0.60257509333762493,9.8570846235179296E-2,7.8656224125086063E-2,"Baa1",8.0523198420533078,1.3119655445902851,0.68452751079516128,8.6350173770180186E-2,5.7129695951335581E-2,"Baa2",8.7847533632286989]
{"$rows_left_out":7}
{"sheet":"Rating (Ofgem-notional)","index":2,"n_rows":97,"n_cols":14,"rows_kept":97,"cut":false,"hidden":true,"merged":[]}
["Moody's rating calculator"]
[]
[null,"Numerical score",null,null,"Penalty Weights",null,null,"Grid Rating"]
[]
[null,"Caa",18,null,"Caa",5,null,0,"Aaa"]
[null,"B",15,null,"B",3,null,1.49,"Aa1"]
[null,"Ba",12,null,"Ba",2,null,2.4900000000000002,"Aa2"]
[null,"Baa",9,null,"Baa",1.1499999999999999,null,3.49,"Aa3"]
[null,"A",6,null,"Aaa",1,null,4.49,"A1"]
[null,"Aa",3,null,"Aa",1,null,5.49,"A2"]
[null,"Aaa",1,null,"A",1,null,6.49,"A3"]
[null,null,null,null,null,null,null,7.49,"Baa1"]
[null,null,null,null,null,null,null,8.49,"Baa2"]
[null,null,null,null,null,null,null,9.49,"Baa3"]
[null,null,null,null,null,null,null,10.49,"Ba1"]
{"$rows_left_out":83}
{"sheet":"Rating (Ofgem-actual)","index":3,"n_rows":97,"n_cols":14,"rows_kept":97,"cut":false,"hidden":true,"merged":[]}
["Moody's rating calculator"]
[]
[null,"Numerical score",null,null,"Penalty Weights",null,null,"Grid Rating"]
[]
[null,"Caa",18,null,"Caa",5,null,0,"Aaa"]
[null,"B",15,null,"B",3,null,1.49,"Aa1"]
[null,"Ba",12,null,"Ba",2,null,2.4900000000000002,"Aa2"]
[null,"Baa",9,null,"Baa",1.1499999999999999,null,3.49,"Aa3"]
[null,"A",6,null,"Aaa",1,null,4.49,"A1"]
[null,"Aa",3,null,"Aa",1,null,5.49,"A2"]
[null,"Aaa",1,null,"A",1,null,6.49,"A3"]
[null,null,null,null,null,null,null,7.49,"Baa1"]
[null,null,null,null,null,null,null,8.49,"Baa2"]
[null,null,null,null,null,null,null,9.49,"Baa3"]
[null,null,null,null,null,null,null,10.49,"Ba1"]
{"$rows_left_out":83}
{"sheet":"NGN","index":4,"n_rows":84,"n_cols":7,"rows_kept":84,"cut":false,"hidden":false,"merged":[]}
["Parameter","AICR","Gearing","FFO/Net Debt","RCF/Net Debt","FFO Interest Cover"]
["Baa1 Target",{"$f":"'Rating (Ofgem-notional)'!$C$77","v":1.4},{"$f":"'Rating (Ofgem-notional)'!$H$78","v":0.75},{"$f":"'Rating (Ofgem-notional)'!$D$77","v":0.11},{"$f":"'Rating (Ofgem-notional)'!$E$77","v":7.0000000000000007E-2},2.5]
["Baseline",1.3,0.7,0.09,0.05]
["Real to nominal prices conversion factor",{"$f":"[7]Input!AP92","v":1.0792234436566936},{"$f":"[7]Input!AQ92","v":1.1008045880729058},{"$f":"[7]Input!AR92","v":1.1228172888985442},{"$f":"[7]Input!AS92","v":1.1452701759324246},{"$f":"[7]Input!AT92","v":1.1681720515427552}]
[]
["Table A33.5. Financial Parameters (notional): NGN's proposals",null,null,null,null,null,"£m, 18/19 prices"]
["Parameter","2021/22","2022/23","2023/24","2024/25","2025/26","GD-2 Average"]
["Closing RAV",{"$f":"[8]ScenarioRun_AllOutputData!AP101/B4","v":2277.9851356559325},{"$f":"[8]ScenarioRun_AllOutputData!AQ101/C4","v":2326.6762415340932},{"$f":"[8]ScenarioRun_AllOutputData!AR101/D4","v":2371.6069037836273},{"$f":"[8]ScenarioRun_AllOutputData!AS101/E4","v":2407.6785586694455},{"$f":"[8]ScenarioRun_AllOutputData!AT101/F4","v":2433.6542773712013},{"$f":"AVERAGE(B8:F8)","v":2363.5202234028598}]
["Fast Money, %",{"$f":"[8]TIM!AP144/([8]TIM!AP144+[8]TIM!AP146)","v":0.35242445118646271},{"$f":"[8]TIM!AQ144/([8]TIM!AQ144+[8]TIM!AQ146)","v":0.33909841164462556},{"$f":"[8]TIM!AR144/([8]TIM!AR144+[8]TIM!AR146)","v":0.33704944118026919},{"$f":"[8]TIM!AS144/([8]TIM!AS144+[8]TIM!AS146)","v":0.33932719124171867},{"$f":"[8]TIM!AT144/([8]TIM!AT144+[8]TIM!AT146)","v":0.35047587834001787},{"$f":"AVERAGE(B9:F9)","v":0.3436750747186188}]
["Slow Money, %",{"$f":"[8]TIM!AP146/([8]TIM!AP144+[8]TIM!AP146)","v":0.64757554881353729},{"$f":"[8]TIM!AQ146/([8]TIM!AQ144+[8]TIM!AQ146)","v":0.66090158835537438},{"$f":"[8]TIM!AR146/([8]TIM!AR144+[8]TIM!AR146)","v":0.66295055881973075},{"$f":"[8]TIM!AS146/([8]TIM!AS144+[8]TIM!AS146)","v":0.66067280875828138},{"$f":"[8]TIM!AT146/([8]TIM!AT144+[8]TIM!AT146)","v":0.64952412165998208},0.6563249252813812]
["Fast pot expenditure",{"$f":"[8]ScenarioRun_AllOutputData!AP102/B4","v":87.826896444845829},{"$f":"[8]ScenarioRun_AllOutputData!AQ102/C4","v":86.563012823589986},{"$f":"[8]ScenarioRun_AllOutputData!AR102/D4","v":85.816418981275746},{"$f":"[8]ScenarioRun_AllOutputData!AS102/E4","v":84.198432057054006},{"$f":"[8]ScenarioRun_AllOutputData!AT102/F4","v":84.909718941974617},85.862895849748028]
["Non-controllable opex",{"$f":"[8]ScenarioRun_AllOutputData!AP103/B4","v":95.206074704172721},{"$f":"[8]ScenarioRun_AllOutputData!AQ103/C4","v":95.071821422426382},{"$f":"[8]ScenarioRun_AllOutputData!AR103/D4","v":92.899248800816224},{"$f":"[8]ScenarioRun_AllOutputData!AS103/E4","v":91.384081847178919},{"$f":"[8]ScenarioRun_AllOutputData!AT103/F4","v":89.385407559439571},92.789326866806761]
["RAV depreciation",{"$f":"[8]ScenarioRun_AllOutputData!AP104/B4","v":115.91769497142201},{"$f":"[8]ScenarioRun_AllOutputData!AQ104/C4","v":119.81378458917922},{"$f":"[8]ScenarioRun_AllOutputData!AR104/D4","v":123.86369243125715},{"$f":"[8]ScenarioRun_AllOutputData!AS104/E4","v":127.76337901646362},{"$f":"[8]ScenarioRun_AllOutputData!AT104/F4","v":131.28435662610121},123.72858152688464]
["Return",{"$f":"[8]ScenarioRun_AllOutputData!AP105/B4","v":77.943159359150201},{"$f":"[8]ScenarioRun_AllOutputData!AQ105/C4","v":78.4990959987731},{"$f":"[8]ScenarioRun_AllOutputData!AR105/D4","v":79.252552132308836},{"$f":"[8]ScenarioRun_AllOutputData!AS105/E4","v":79.968529998114931},{"$f":"[8]ScenarioRun_AllOutputData!AT105/F4","v":80.529119373719453},79.238491372413293]
["Equity issuance cost",{"$f":"[8]ScenarioRun_AllOutputData!AP106/B4","v":5.472484649838032},{"$f":"[8]ScenarioRun_AllOutputData!AQ106/C4","v":0},{"$f":"[8]ScenarioRun_AllOutputData!AR106/D4","v":0},{"$f":"[8]ScenarioRun_AllOutputData!AS106/E4","v":0},{"$f":"[8]ScenarioRun_AllOutputData!AT106/F4","v":0},1.0944969299676064]
{"$rows_left_out":70}
{"sheet":"Scenario results (NGN)","index":5,"n_rows":21,"n_cols":13,"rows_kept":21,"cut":false,"hidden":false,"merged":[[3,1,3,5],[3,7,3,11],[5,1,5,5],[5,7,5,11]]}
["Scenario","AICR","Gearing","FFO/Net Debt","RCF/Net Debt","Moodys' implied rating",null,"AICR","Gearing","FFO/Net Debt","RCF/Net Debt","Moodys' implied rating"]
["Baa1 Target",{"$f":"'Rating (Ofgem-notional)'!$C$77","v":1.4},{"$f":"'Rating (Ofgem-notional)'!$H$78","v":0.75},{"$f":"'Rating (Ofgem-notional)'!$D$77","v":0.11},{"$f":"'Rating (Ofgem-notional)'!$E$77","v":7.0000000000000007E-2},{"$f":"'Rating (Ofgem-notional)'!$H$13","v":8.49},null,{"$f":"'Rating (Ofgem-notional)'!$C$77","v":1.4},{"$f":"'Rating (Ofgem-notional)'!$H$78","v":0.75},{"$f":"'Rating (Ofgem-notional)'!$D$77","v":0.11},{"$f":"'Rating (Ofgem-notional)'!$E$77","v":7.0000000000000007E-2},{"$f":"'Rating (Ofgem-notional)'!$H$13","v":8.49}]
["Baseline",1.3,0.7,0.09,0.05,{"$f":"'Rating (Ofgem-notional)'!$H$14","v":9.49},null,1.3,0.7,0.09,0.05,{"$f":"'Rating (Ofgem-notional)'!$H$14","v":9.49}]
["Active selection"]
["RoRe underperformance (-2%)",{"$f":"INDEX(NGN!B$52:B$66,MATCH(ActiveScenario,NGN!$A$52:$A$66,0))","v":1.0847836069717072},{"$f":"INDEX(NGN!C$52:C$66,MATCH(ActiveScenario,NGN!$A$52:$A$66,0))","v":0.63064535737274297},{"$f":"INDEX(NGN!D$52:D$66,MATCH(ActiveScenario,NGN!$A$52:$A$66,0))","v":8.1414086925328658E-2},{"$f":"INDEX(NGN!E$52:E$66,MATCH(ActiveScenario,NGN!$A$52:$A$66,0))","v":5.9204815236312325E-2},{"$f":"'Rating (NGN-notional)'!$N$63","v":"Baa3"},{"$f":"'Rating (NGN-notional)'!N61","v":9.6025104602510449},{"$f":"INDEX(NGN!B$70:B$84,MATCH(ActiveScenario,NGN!$A$52:$A$66,0))","v":1.2401922662344802},{"$f":"INDEX(NGN!C$70:C$84,MATCH(ActiveScenario,NGN!$A$52:$A$66,0))","v":0.68466821522936494},{"$f":"INDEX(NGN!D$70:D$84,MATCH(ActiveScenario,NGN!$A$52:$A$66,0))","v":8.3968847429984061E-2},{"$f":"INDEX(NGN!E$70:E$84,MATCH(ActiveScenario,NGN!$A$52:$A$66,0))","v":5.474876374636619E-2},{"$f":"'Rating (NGN-actual)'!N63","v":"Baa2"},{"$f":"'Rating (NGN-actual)'!N61","v":8.7847533632286989}]
[null,"Notional Financial Structure",null,null,null,null,null,"Actual Financial Structure"]
["NGN Base case",1.4600359394421214,0.60653131509039837,9.8890886526206978E-2,7.5808540386838152E-2,"Baa1",8.0523198420533078,1.4810795340721508,0.67303490958839007,9.3261584308239415E-2,6.3544750968454577E-2,"Baa1",8.3123209169054437]
["High interest rates (+1%)",1.4924012284739585,0.60306056937978358,0.10152637515250049,7.8311355169783076E-2,"Baa1",8.0523198420533078,1.4124916994116057,0.67342027174818475,9.26701974098115E-2,6.2970046601624932E-2,"Baa1",8.3123209169054437]
["Low interest rates (-1%)",1.4257425179273837,0.60998492402657378,9.6307379406101429E-2,7.3355224646024592E-2,"Baa1",8.0523198420533078,1.5758148742384805,0.67265647378701166,9.3851351904829614E-2,6.4118021076847789E-2,"Baa1",8.3123209169054437]
["High inflation (+1%)",1.494134669013627,0.59328277821714237,9.9723597922586088E-2,7.6124507923623158E-2,"Baa1",7.7374749498997994,1.5407030112566844,0.64024878745705815,9.9236156330878358E-2,6.9478560934743999E-2,"Baa1",8.3123209169054437]
["Low inflation (-1%)",1.426487200167696,0.62031090066090733,9.811808750637474E-2,7.5544600012472735E-2,"Baa1",8.0523198420533078,1.4240038366823737,0.70795771545618735,8.7560152930606788E-2,5.7882308248192203E-2,"Baa1",8.3123209169054437]
["High CPIH-RPI divergence (+0.5%)",1.4431930997102278,0.61335297117767085,9.8497015549936548E-2,7.5670080606030393E-2,"Baa1",8.0523198420533078,1.4652189294081306,0.6832140591789011,9.1579916971508621E-2,6.1869359348644883E-2,"Baa1",8.3123209169054437]
["Low CPIH-RPI divergence (-0.5%)",1.4770162770280042,0.59984239307984777,9.9299735588913321E-2,7.596000694991939E-2,"Baa1",7.7374749498997994,1.4972020688191354,0.66308569423022079,9.4968974169920742E-2,6.5245649543701975E-2,"Baa1",8.3123209169054437]
["RPI ILD",1.5662225065601578,0.60649808135928618,9.8909976645518802E-2,7.5826366131320419E-2,"Baa1",8.0523198420533078,1.4810795340721508,0.67303490958839007,9.3261584308239415E-2,6.3544750968454577E-2,"Baa1",8.3123209169054437]
["High ILD proportion (+5%)",1.4980114119742225,0.60652769435450227,9.8892925336413695E-2,7.5810441433816447E-2,"Baa1",8.0523198420533078,1.4810867085516066,0.67303429406328774,9.3261891677734549E-2,6.3545031169118846E-2,"Baa1",8.3123209169054437]
{"$rows_left_out":7}
{"sheet":"Rating (NGN-notional)","index":6,"n_rows":97,"n_cols":14,"rows_kept":97,"cut":false,"hidden":true,"merged":[]}
["Moody's rating calculator"]
[]
[null,"Numerical score",null,null,"Penalty Weights",null,null,"Grid Rating"]
[]
[null,"Caa",18,null,"Caa",5,null,0,"Aaa"]
[null,"B",15,null,"B",3,null,1.49,"Aa1"]
[null,"Ba",12,null,"Ba",2,null,2.4900000000000002,"Aa2"]
[null,"Baa",9,null,"Baa",1.1499999999999999,null,3.49,"Aa3"]
[null,"A",6,null,"Aaa",1,null,4.49,"A1"]
[null,"Aa",3,null,"Aa",1,null,5.49,"A2"]
[null,"Aaa",1,null,"A",1,null,6.49,"A3"]
[null,null,null,null,null,null,null,7.49,"Baa1"]
[null,null,null,null,null,null,null,8.49,"Baa2"]
[null,null,null,null,null,null,null,9.49,"Baa3"]
[null,null,null,null,null,null,null,10.49,"Ba1"]
{"$rows_left_out":83}
{"sheet":"Rating (NGN-actual)","index":7,"n_rows":97,"n_cols":14,"rows_kept":97,"cut":false,"hidden":true,"merged":[]}
["Moody's rating calculator"]
[]
[null,"Numerical score",null,null,"Penalty Weights",null,null,"Grid Rating"]
[]
[null,"Caa",18,null,"Caa",5,null,0,"Aaa"]
[null,"B",15,null,"B",3,null,1.49,"Aa1"]
[null,"Ba",12,null,"Ba",2,null,2.4900000000000002,"Aa2"]
[null,"Baa",9,null,"Baa",1.1499999999999999,null,3.49,"Aa3"]
[null,"A",6,null,"Aaa",1,null,4.49,"A1"]
[null,"Aa",3,null,"Aa",1,null,5.49,"A2"]
[null,"Aaa",1,null,"A",1,null,6.49,"A3"]
[null,null,null,null,null,null,null,7.49,"Baa1"]
[null,null,null,null,null,null,null,8.49,"Baa2"]
[null,null,null,null,null,null,null,9.49,"Baa3"]
[null,null,null,null,null,null,null,10.49,"Ba1"]
{"$rows_left_out":82}